Euphoria Ticket #810: Errors with t_io.e on MacOSX 10.6.8

interpreting t_io.e: 
  failed: Seek STDIN, expected: 1 but got: 0 
  failed: Seek STDOUT, expected: 1 but got: 0 
  failed: Seek STDERR, expected: 1 but got: 0 
  71 tests run, 68 passed, 3 failed, 96% success 
FAILURE: t_io.e program died with status 256 
 
binding t_io.e: 
deleted 308 unused routines and 1419 unused variables. 
You may now run .//Users/bruceaxtens/Downloads/euphoria-d1184c7c7a14/tests/t_io 
  failed: Seek STDIN, expected: 1 but got: 0 
  failed: Seek STDOUT, expected: 1 but got: 0 
  failed: Seek STDERR, expected: 1 but got: 0 
  71 tests run, 68 passed, 3 failed, 96% success 
FAILURE: t_io program died with status 256 
 
translating t_io.e:  failed: Seek STDIN, expected: 1 but got: 0 
  failed: Seek STDOUT, expected: 1 but got: 0 
  failed: Seek STDERR, expected: 1 but got: 0 
  71 tests run, 68 passed, 3 failed, 96% success 
FAILURE: t_io program died with status 256 
 
 
 
Version 
---------------------------- 
4.1.0 development (0:unknown, unknown) 
 
Operating System 
---------------------------- 
Platform: Darwin, Build: Bassano.local, 10.8.0:0 
 
Include Directories 
---------------------------- 
1: /Users/bruceaxtens/Downloads/euphoria-d1184c7c7a14/bin 
2: /Users/bruceaxtens/Downloads/euphoria-d1184c7c7a14/include 
 
EUDIR 
---------------------------- 
/Users/bruceaxtens/Downloads/euphoria-d1184c7c7a14 
 
PATH 
---------------------------- 
/opt/local/bin:/opt/local/sbin:/sw/bin:/sw/sbin:/Users/bruceaxtens/bin:/Users/bruceaxtens/bin/euphoria/bin:/opt/local/bin:/opt/local/sbin:/usr/bin:/bin:/usr/sbin:/sbin:/usr/local/bin:/usr/local/git/bin:/usr/local/go/bin:/usr/X11/bin:/usr/X11R6/bin 
 

Details

Type: Bug Report Severity: Normal Category: Unit Tests
Assigned To: jaygade Status: New Reported Release: 4.1.0
Fixed in SVN #: View VCS: none Milestone:

Search



Quick Links

User menu

Not signed in.

Misc Menu